The OpenNET Project / Index page

[ новости /+++ | форум | wiki | теги | ]

форумы  помощь  поиск  регистрация  майллист  вход/выход  слежка  RSS
"не собирается cyrus-sasl"
Вариант для распечатки  
Пред. тема | След. тема 
Форумы OpenNET: Виртуальная конференция (Public)
Изначальное сообщение [ Отслеживать ]

"не собирается cyrus-sasl"  
Сообщение от kilex (ok) on 13-Фев-09, 13:34 
В общем цель - поднять sendmail c pop и imap. для имапа и использования маилбоксов необходимо ставить cyrus. скачал исходники, начал с cyrus-sasl-2.1.22.

./configure проходит нормально

...
checking for getaddrinfo... (cached) yes
checking for getnameinfo... (cached) yes
checking whether you have ss_family in struct sockaddr_storage... (cached) yes
checking whether you have sa_len in struct sockaddr... (cached) no
checking for socklen_t... (cached) yes
configure: creating ./config.status
config.status: creating Makefile
config.status: creating saslauthd.h
config.status: saslauthd.h is unchanged
config.status: executing depfiles commands
Configuration Complete. Type 'make' to build.

а вот мейк нивкакую не хочет:

gcc -DHAVE_CONFIG_H -I. -I. -I.. -I../include -I../lib -I../sasldb -I../include -Wall -W -g -O2 -MT digestmd5.lo -MD -MP -MF .deps/digestmd5.Tpo -c digestmd5.c  -fPIC -DPIC -o digestmd5.lo
digestmd5.c:279: warning: pointer targets in initialization differ in signedness
digestmd5.c: In function 'DigestCalcResponse':
digestmd5.c:366: warning: pointer targets in passing argument 2 of 'utils->MD5Update' differ in signedness
digestmd5.c: At top level:
digestmd5.c:812: error: expected specifier-qualifier-list before 'des_key_schedule'
digestmd5.c: In function 'dec_3des':
digestmd5.c:849: warning: implicit declaration of function 'des_ede2_cbc_encrypt'
digestmd5.c:852: error: 'des_context_t' has no member named 'keysched'
digestmd5.c:853: error: 'des_context_t' has no member named 'keysched2'
digestmd5.c:854: error: 'des_context_t' has no member named 'ivec'
digestmd5.c:855: error: 'DES_DECRYPT' undeclared (first use in this function)
digestmd5.c:855: error: (Each undeclared identifier is reported only once
digestmd5.c:855: error: for each function it appears in.)
digestmd5.c:842: warning: unused parameter 'digest'
digestmd5.c: In function 'enc_3des':
digestmd5.c:900: error: 'des_context_t' has no member named 'keysched'
digestmd5.c:901: error: 'des_context_t' has no member named 'keysched2'
digestmd5.c:902: error: 'des_context_t' has no member named 'ivec'
digestmd5.c:903: error: 'DES_ENCRYPT' undeclared (first use in this function)
digestmd5.c: In function 'init_3des':
digestmd5.c:923: warning: implicit declaration of function 'des_key_sched'
digestmd5.c:923: error: 'des_cblock' undeclared (first use in this function)
digestmd5.c:923: error: expected expression before ')' token
digestmd5.c:927: error: expected expression before ')' token
digestmd5.c:929: error: 'des_context_t' has no member named 'ivec'
digestmd5.c:936: error: expected expression before ')' token
digestmd5.c:940: error: expected expression before ')' token
digestmd5.c:943: error: 'des_context_t' has no member named 'ivec'
digestmd5.c: In function 'dec_des':
digestmd5.c:967: warning: implicit declaration of function 'des_cbc_encrypt'
digestmd5.c:970: error: 'des_context_t' has no member named 'keysched'
digestmd5.c:971: error: 'des_context_t' has no member named 'ivec'
digestmd5.c:972: error: 'DES_DECRYPT' undeclared (first use in this function)
digestmd5.c:976: error: 'des_context_t' has no member named 'ivec'
digestmd5.c:960: warning: unused parameter 'digest'
digestmd5.c: In function 'enc_des':
digestmd5.c:1021: error: 'des_context_t' has no member named 'keysched'
digestmd5.c:1022: error: 'des_context_t' has no member named 'ivec'
digestmd5.c:1023: error: 'DES_ENCRYPT' undeclared (first use in this function)
digestmd5.c:1027: error: 'des_context_t' has no member named 'ivec'
digestmd5.c: In function 'init_des':
digestmd5.c:1047: error: 'des_cblock' undeclared (first use in this function)
digestmd5.c:1047: error: expected expression before ')' token
digestmd5.c:1049: error: 'des_context_t' has no member named 'ivec'
digestmd5.c:1056: error: expected expression before ')' token
digestmd5.c:1058: error: 'des_context_t' has no member named 'ivec'
digestmd5.c: In function 'dec_rc4':
digestmd5.c:1211: warning: unused parameter 'digest'
digestmd5.c: In function 'digestmd5_encode':
digestmd5.c:1401: warning: pointer targets in passing argument 5 of 'text->utils->hmac_md5' differ in signedness
digestmd5.c: In function 'digestmd5_decode_packet':
digestmd5.c:1497: warning: pointer targets in assignment differ in signedness
digestmd5.c: In function 'digestmd5_server_mech_new':
digestmd5.c:1797: warning: unused parameter 'challenge'
digestmd5.c:1798: warning: unused parameter 'challen'
digestmd5.c: In function 'digestmd5_server_mech_step1':
digestmd5.c:1947: warning: pointer targets in passing argument 6 of 'add_to_challenge' differ in signedness
digestmd5.c:1820: warning: unused parameter 'clientin'
digestmd5.c:1821: warning: unused parameter 'clientinlen'
digestmd5.c:1824: warning: unused parameter 'oparams'
digestmd5.c: In function 'digestmd5_server_mech_step2':
digestmd5.c:2100: warning: dereferencing type-punned pointer will break strict-aliasing rules
digestmd5.c:2117: warning: dereferencing type-punned pointer will break strict-aliasing rules
digestmd5.c:2235: warning: dereferencing type-punned pointer will break strict-aliasing rules
digestmd5.c:2235: warning: pointer targets in passing argument 2 of '_plug_strdup' differ in signedness
digestmd5.c:2238: warning: dereferencing type-punned pointer will break strict-aliasing rules
digestmd5.c:2238: warning: pointer targets in passing argument 2 of '_plug_strdup' differ in signedness
digestmd5.c:2274: warning: pointer targets in passing argument 1 of 'strlen' differ in signedness
digestmd5.c:2274: warning: pointer targets in passing argument 1 of '__builtin_strcmp' differ in signedness
digestmd5.c:2274: warning: pointer targets in passing argument 1 of 'strlen' differ in signedness
digestmd5.c:2274: warning: pointer targets in passing argument 1 of '__builtin_strcmp' differ in signedness
digestmd5.c:2274: warning: pointer targets in passing argument 1 of '__builtin_strcmp' differ in signedness
digestmd5.c:2274: warning: pointer targets in passing argument 1 of '__builtin_strcmp' differ in signedness
digestmd5.c:2286: warning: pointer targets in passing argument 1 of 'strlen' differ in signedness
digestmd5.c:2286: warning: pointer targets in passing argument 1 of 'strlen' differ in signedness
digestmd5.c:2286: warning: pointer targets in passing argument 1 of '__builtin_strcmp' differ in signedness
digestmd5.c:2286: warning: pointer targets in passing argument 2 of '__builtin_strcmp' differ in signedness
digestmd5.c:2286: warning: pointer targets in passing argument 1 of 'strlen' differ in signedness
digestmd5.c:2286: warning: pointer targets in passing argument 1 of '__builtin_strcmp' differ in signedness
digestmd5.c:2286: warning: pointer targets in passing argument 2 of '__builtin_strcmp' differ in signedness
digestmd5.c:2286: warning: pointer targets in passing argument 1 of 'strlen' differ in signedness
digestmd5.c:2286: warning: pointer targets in passing argument 1 of '__builtin_strcmp' differ in signedness
digestmd5.c:2286: warning: pointer targets in passing argument 2 of '__builtin_strcmp' differ in signedness
digestmd5.c:2286: warning: pointer targets in passing argument 1 of '__builtin_strcmp' differ in signedness
digestmd5.c:2286: warning: pointer targets in passing argument 2 of '__builtin_strcmp' differ in signedness
digestmd5.c:2351: warning: pointer targets in passing argument 1 of '__builtin_strncpy' differ in signedness
digestmd5.c:2369: warning: pointer targets in passing argument 2 of 'DigestCalcSecret' differ in signedness
digestmd5.c:2369: warning: pointer targets in passing argument 3 of 'DigestCalcSecret' differ in signedness
digestmd5.c:2514: warning: pointer targets in passing argument 2 of 'text->cipher_init' differ in signedness
digestmd5.c:2514: warning: pointer targets in passing argument 3 of 'text->cipher_init' differ in signedness
digestmd5.c: In function 'make_client_response':
digestmd5.c:3010: warning: pointer targets in passing argument 3 of 'calculate_response' differ in signedness
digestmd5.c:3010: warning: pointer targets in passing argument 11 of 'calculate_response' differ in signedness
digestmd5.c:3034: warning: pointer targets in passing argument 6 of 'add_to_challenge' differ in signedness
digestmd5.c:3145: warning: pointer targets in passing argument 2 of 'text->cipher_init' differ in signedness
digestmd5.c:3145: warning: pointer targets in passing argument 3 of 'text->cipher_init' differ in signedness
digestmd5.c: In function 'parse_server_challenge':
digestmd5.c:3229: warning: dereferencing type-punned pointer will break strict-aliasing rules
digestmd5.c: In function 'digestmd5_client_mech_step1':
digestmd5.c:3732: warning: dereferencing type-punned pointer will break strict-aliasing rules
digestmd5.c:3732: warning: pointer targets in passing argument 2 of '_plug_strdup' differ in signedness
digestmd5.c:3735: warning: dereferencing type-punned pointer will break strict-aliasing rules
digestmd5.c:3735: warning: pointer targets in passing argument 2 of '_plug_strdup' differ in signedness
digestmd5.c:3703: warning: unused parameter 'serverin'
digestmd5.c:3704: warning: unused parameter 'serverinlen'
digestmd5.c: In function 'digestmd5_client_mech_step3':
digestmd5.c:3838: warning: unused parameter 'prompt_need'
digestmd5.c:3839: warning: unused parameter 'clientout'
digestmd5.c:3840: warning: unused parameter 'clientoutlen'
digestmd5.c: In function 'digestmd5_client_mech_step':
digestmd5.c:4000: warning: pointer targets in assignment differ in signedness
make[2]: *** [digestmd5.lo] Ошибка 1
make[2]: Leaving directory `/usr/src/cyrus-sasl-2.1.22/plugins'
make[1]: *** [all-recursive] Ошибка 1
make[1]: Leaving directory `/usr/src/cyrus-sasl-2.1.22'
make: *** [all] Ошибка 2

Высказать мнение | Ответить | Правка | Cообщить модератору

 Оглавление

Сообщения по теме [Сортировка по времени | RSS]


1. "не собирается cyrus-sasl"  
Сообщение от ronin (??) on 13-Фев-09, 16:55 

Пакет openssl-devel стоит? Если нет - рекомендую поставить.
Высказать мнение | Ответить | Правка | Наверх | Cообщить модератору

2. "не собирается cyrus-sasl"  
Сообщение от Ань on 13-Фев-09, 17:18 
Если вы не эксперимента ради собираете cyrus, то установите его из готового пакета для вашего дистрибутива.
Высказать мнение | Ответить | Правка | Наверх | Cообщить модератору

Архив | Удалить

Индекс форумов | Темы | Пред. тема | След. тема
Оцените тред (1=ужас, 5=супер)? [ 1 | 2 | 3 | 4 | 5 ] [Рекомендовать для помещения в FAQ]




Спонсоры:
PostgresPro
Inferno Solutions
Hosting by Hoster.ru
Хостинг:

Закладки на сайте
Проследить за страницей
Created 1996-2022 by Maxim Chirkov
Добавить, Поддержать, Вебмастеру